{"text_format":"1","workbook":"xlsx","n_sheets":4,"sheets":["Form2","Data","List","matrix"],"not_rendered":{"charts":0,"images":2,"macros":1,"external_links":0,"defined_names":209,"comments":0,"pivot_tables":0},"unopened":[],"bounds":{"document_bytes":16777216,"sheet_cells":100000,"rows_first":2000,"rows_last":500,"rows_between":2000,"halvings":0,"cell_chars":16384,"cell_head_chars":4096},"cells_cut":0,"cells_raw":0,"read":"whole","date_system":"1900"}

{"sheet":"Form2","index":0,"n_rows":212,"n_cols":75,"rows_kept":212,"cut":false,"hidden":false,"merged":[[53,1,54,22],[62,1,62,11],[63,1,65,11],[157,1,157,75],[114,1,115,14],[124,1,125,14],[134,1,134,5],[100,44,100,51],[134,50,134,57],[134,42,134,49],[130,42,131,49],[130,50,131,57],[102,44,102,51],[104,44,104,51],[106,44,106,51],[106,13,106,15],[129,1,131,5],[132,1,132,5],[133,1,133,5],[129,66,131,73],[129,11,131,22],[104,13,104,15],[104,68,104,74],[106,68,106,74],[37,69,37,75],[9,28,9,39],[10,28,10,39],[9,1,9,13],[10,1,10,13],[10,22,10,24],[37,1,37,6],[13,9,13,16],[13,1,13,8],[27,1,31,11],[17,1,19,11],[23,39,23,50],[24,39,24,50],[24,1,24,12],[23,1,23,12],[25,1,25,12],[26,1,26,24],[17,43,17,50],[18,43,18,50],[13,25,13,32],[14,42,14,54],[13,42,13,61],[37,41,37,52],[15,43,15,48],[51,1,52,28],[46,20,46,74],[25,39,25,50],[23,13,23,38],[24,13,24,38],[23,51,23,75],[26,25,26,38],[18,14,18,26],[26,39,26,50],[26,51,26,75],[42,7,42,24],[45,1,46,11],[40,61,40,68],[39,41,39,52],[37,53,37,60],[19,14,19,51],[19,54,19,74],[41,61,41,68],[42,53,42,60],[38,1,38,6],[39,69,39,75],[40,53,40,60],[39,61,39,68],[42,61,42,68],[41,7,41,24],[81,31,82,33],[82,62,82,70],[82,71,82,75],[80,1,80,11],[100,68,100,74],[13,71,13,75],[13,62,13,70],[13,17,13,24],[13,33,13,41],[24,51,25,75],[32,1,32,23],[29,58,29,74],[31,58,31,74],[25,27,25,38],[14,13,14,24],[14,55,14,63],[14,64,14,75],[15,68,16,75],[15,55,15,67],[16,55,16,67],[15,49,15,54],[16,49,16,54],[15,31,15,36],[68,35,68,75],[69,35,69,75],[55,1,55,20],[55,35,55,75],[56,1,56,20],[56,35,56,75],[58,19,59,75],[57,1,57,75],[73,1,73,75],[81,1,82,11],[81,14,82,16],[106,22,106,24],[77,1,77,11],[100,13,100,15],[102,22,102,24],[100,30,100,32],[100,22,100,24],[102,68,102,74],[81,19,82,23],[81,25,82,28],[100,3,107,7],[78,1,78,11],[140,34,140,41],[51,42,51,74],[15,37,15,42],[138,28,140,33],[138,23,140,27],[130,34,131,41],[104,22,104,24],[104,30,104,32],[135,11,137,22],[138,11,140,22],[95,1,96,13],[84,1,85,18],[102,13,102,15],[84,19,85,75],[95,14,96,75],[92,15,92,31],[92,54,92,75],[93,19,93,31],[93,47,93,75],[132,50,132,57],[111,15,111,31],[129,6,131,10],[102,30,102,32],[112,19,112,31],[140,66,140,73],[134,66,134,73],[135,66,135,73],[136,66,136,73],[135,50,135,57],[136,50,136,57],[137,50,137,57],[135,42,135,49],[137,66,137,73],[135,58,135,65],[139,50,139,57],[140,58,140,65],[138,58,138,65],[139,58,139,65],[136,42,136,49],[138,42,138,49],[138,66,138,73],[139,66,139,73],[140,42,140,49],[137,42,137,49],[144,10,144,41],[132,6,134,10],[140,50,140,57],[135,34,135,41],[136,58,136,65],[135,28,137,33],[135,23,137,27],[138,50,138,57],[135,6,137,10],[132,34,132,41],[132,42,132,49],[144,1,145,9],[138,6,140,10],[132,11,134,22],[136,34,136,41],[140,1,140,5],[135,1,135,5],[136,1,136,5],[137,1,137,5],[138,1,138,5],[139,1,139,5],[138,34,138,41],[139,34,139,41],[141,1,141,73],[148,65,148,70],[145,10,145,15],[145,16,145,24],[145,25,145,33],[145,34,145,41],[145,54,145,59],[153,26,154,59],[155,26,155,59],[153,6,154,25],[155,6,155,25],[148,34,148,41],[147,34,147,41],[145,60,145,64],[145,65,145,70],[149,16,149,24],[149,65,149,70],[147,60,147,64],[148,60,148,64],[149,60,149,64],[146,65,146,70],[150,1,150,75],[145,71,145,75],[0,1,0,75],[2,1,2,75],[1,1,1,75],[9,40,9,50],[10,40,10,50],[8,51,8,63],[9,51,9,69],[10,51,10,65],[8,1,8,17],[8,18,8,50],[7,35,7,48],[7,49,7,57],[7,58,7,63],[7,64,7,75],[8,64,8,75],[9,70,9,75],[7,1,7,12],[10,66,10,75],[9,14,9,21],[10,14,10,21],[7,13,7,34],[9,22,9,24],[9,25,9,27],[10,25,10,27],[211,0,211,76],[153,70,154,75],[172,1,173,10],[172,12,173,21],[153,60,154,69],[146,1,146,9],[147,1,147,9],[148,1,148,9],[149,1,149,9],[146,10,146,15],[147,10,147,15],[148,10,148,15],[149,10,149,15],[146,16,146,24],[147,16,147,24],[148,16,148,24],[209,21,209,35],[174,12,181,21],[146,54,146,59],[146,60,146,64],[194,1,194,55],[174,1,181,10],[146,34,146,41],[202,18,202,33],[132,66,132,73],[111,54,111,75],[132,58,132,65],[114,15,115,75],[129,28,131,33],[132,28,134,33],[132,23,134,27],[196,1,196,75],[205,18,205,34],[203,1,203,7],[146,71,146,75],[147,71,147,75],[148,71,148,75],[149,71,149,75],[147,54,147,59],[149,54,149,59],[147,65,147,70],[147,25,147,33],[149,25,149,33],[200,1,200,75],[172,23,175,37],[176,23,178,37],[197,1,197,75],[199,1,199,75],[177,68,177,74],[187,39,187,75],[146,44,146,53],[147,44,147,53],[174,56,174,74],[187,1,187,8],[187,9,187,15],[186,1,186,15],[187,16,187,38],[186,16,186,38],[180,39,180,74],[148,25,148,33],[149,44,149,53],[148,54,148,59],[146,25,146,33],[155,70,155,75],[186,39,186,75],[160,1,169,75],[153,1,154,5],[149,34,149,41],[174,45,174,55],[155,1,155,5],[155,60,155,69],[148,44,148,53],[16,43,16,48],[25,13,25,14],[25,25,25,26],[32,24,32,52],[14,25,14,41],[16,37,16,42],[15,1,15,24],[16,1,16,24],[15,25,15,30],[16,25,16,30],[25,15,25,24],[14,1,14,12],[16,31,16,36],[137,34,137,41],[137,58,137,65],[139,42,139,49],[39,53,39,60],[49,62,49,74],[47,51,47,74],[106,30,106,32],[133,34,133,41],[133,42,133,49],[134,58,134,65],[134,34,134,41],[133,50,133,57],[133,58,133,65],[133,66,133,73],[113,1,113,75],[123,1,123,75],[112,47,112,75],[129,58,131,65],[129,34,129,57],[121,15,121,31],[121,54,121,75],[122,47,122,75],[39,7,39,24],[40,41,40,52],[38,7,38,24],[39,25,39,40],[40,7,40,24],[38,53,38,60],[42,25,42,40],[129,23,131,27],[68,1,68,20],[122,19,122,31],[124,15,125,75],[83,1,83,75],[82,47,82,61],[94,1,94,75],[47,1,48,11],[49,1,50,11],[42,1,42,6],[42,41,42,52],[41,53,41,60],[41,69,41,75],[44,1,44,75],[42,69,42,75],[41,1,41,6],[38,41,38,52],[66,1,67,11],[41,41,41,52],[37,61,37,68],[38,69,38,75],[38,25,38,40],[38,61,38,68],[37,7,37,40],[144,44,145,53],[144,54,144,75],[79,1,79,11],[70,1,72,11],[74,1,75,18],[58,1,59,18],[39,1,39,6],[40,1,40,6],[66,59,66,75],[64,51,64,74],[74,19,75,75],[63,41,63,42],[78,39,78,47],[69,1,69,20],[77,58,77,71],[71,40,71,74],[40,69,40,75],[40,25,40,40],[41,25,41,40]]}
[]
[null,"Tree Risk Assessment Form 2  Individual Tree Risk Assessment"]
[null,"樹木風險評估表格2  個別樹木風險評估"]
[]
[]
[null,"General Information  基本資料 \n"]
[]
[null,"Dept. / Agency 部門 / 機構:",null,null,null,null,null,null,null,null,null,null,null,null,null,null,null,null,null,null,null,null,null,null,null,null,null,null,null,null,null,null,null,null,null,"Inspection Officer 巡查人員",null,null,null,null,null,null,null,null,null,null,null,null,null,null,null,null,null,null,null,null,null,null,"Post 職位"]
[null,"Project/Contract No. 工程/合約編號",null,null,null,null,null,null,null,null,null,null,null,null,null,null,null,null,null,null,null,null,null,null,null,null,null,null,null,null,null,null,null,null,null,null,null,null,null,null,null,null,null,null,null,null,null,null,null,null,null,"File Ref. 檔案編號"]
[null,"Date and Time of Inspection",null,null,null,null,null,null,null,null,null,null,null,null,null,null,null,null,null,null,null,null,null,null,null,null,null,null,"Last Inspection Date ",null,null,null,null,null,null,null,null,null,null,null,null,null,null,null,null,null,null,null,null,null,null,"Inspection Time Spent 是次巡查所用時間"]
[null,"巡查日期及時問",null,null,null,null,null,null,null,null,null,null,null,null,"(dd/mm/yyyy)",null,null,null,null,null,null,null,"(hr)",null,null,"(min)",null,null,"上次巡查日期",null,null,null,null,null,null,null,null,null,null,null,"(dd/mm/yyyy)",null,null,null,null,null,null,null,null,null,null,"Inspection Frequency 巡查週期"]
[]
[null,"Tree Information  樹木資料"]
[null,"TMCP Tree ID\nTMCP樹木編號",null,null,null,null,null,null,null,null,null,null,null,null,null,null,null,"Dept. Tree ID\n部門樹木編號",null,null,null,null,null,null,null,null,null,null,null,null,null,null,null,"Tree Species\n樹種",null,null,null,null,null,null,null,null,null,null,null,null,null,null,null,null,null,null,null,null,null,null,null,null,null,null,null,null,"Triage Colour\n分流顏色 "]
[null,"Tree Height(m)\n樹高(米) ",null,null,null,null,null,null,null,null,null,null,null,null,null,null,null,null,null,null,null,null,null,null,null,"Crown Spread(m)\n樹冠闊度(米) ",null,null,null,null,null,null,null,null,null,null,null,null,null,null,null,null,null,null,null,null,null,null,null,null,null,null,null,null,null,"No. of Trunk(s)\n樹幹數目"]
[null,"DBH of tree trunk(s)(mm) ",null,null,null,null,null,null,null,null,null,null,null,null,null,null,null,null,null,null,null,null,null,null,null,1,null,null,null,null,null,2,null,null,null,null,null,3,null,null,null,null,null,4,null,null,null,null,null,5,null,null,null,null,null,"Aggregated DBH (mm)",null,null,null,null,null,null,null,null,null,null,null,null,{"$f":"ROUND(SQRT(TreeTrunkDBH1^2+TreeTrunkDBH2^2+TreeTrunkDBH3^2+TreeTrunkDBH4^2+TreeTrunkDBH5^2),1)","v":0}]
[null,"每枝主幹胸徑(毫米)",null,null,null,null,null,null,null,null,null,null,null,null,null,null,null,null,null,null,null,null,null,null,null,null,null,null,null,null,null,null,null,null,null,null,null,null,null,null,null,null,null,null,null,null,null,null,null,null,null,null,null,null,null,"總胸徑(毫米)"]
[null,"Tree Status\n樹木類別",null,null,null,null,null,null,null,null,null,null,null,null,"Old and Valuable Tree 古樹名木",null,null,null,null,null,null,null,null,null,null,null,null,null,null,"(OVT No. 古樹名木登記冊編號: ",null,null,null,null,null,null,null,null,null,null,null,null,null,null,null,null,null,null,null,null,null,")",null,null,"Other tree 其他樹木"]
[null,null,null,null,null,null,null,null,null,null,null,null,null,null,"Stonewall Tree 石牆樹",null,null,null,null,null,null,null,null,null,null,null,null,null,null,"(Tree Register No. 樹木登記編號:",null,null,null,null,null,null,null,null,null,null,null,null,null,null,null,null,null,null,null,null,null,")",null,null,"Brown Root Rot Disease Infected 受褐根病感染"]
[null,null,null,null,null,null,null,null,null,null,null,null,null,null,"Large Tree(DBH ≥ 500mm or overall height ≥ 9m) 大樹(胸徑≥500毫米或高度≥9米)",null,null,null,null,null,null,null,null,null,null,null,null,null,null,null,null,null,null,null,null,null,null,null,null,null,null,null,null,null,null,null,null,null,null,null,null,null,null,null,"Tree in Confined Site 擠迫地點的樹木"]
[]
[]
[null,"Location Information  位置資料"]
[null,"Masterzone Ref. 主區編號",null,null,null,null,null,null,null,null,null,null,null,null,null,null,null,null,null,null,null,null,null,null,null,null,null,null,null,null,null,null,null,null,null,null,null,null,null,"Location (Chinese) 地點 (中文)"]
[null,"Subzone Ref. 副區編號 ",null,null,null,null,null,null,null,null,null,null,null,null,null,null,null,null,null,null,null,null,null,null,null,null,null,null,null,null,null,null,null,null,null,null,null,null,null,"Location (English) 地點 (英文) "]
[null,"Coordinates 座標",null,null,null,null,null,null,null,null,null,null,null,"X:",null,null,null,null,null,null,null,null,null,null,null,"Y:"]
[null,"Tree Risk Management Zone Category\n樹木風險管理地區類別",null,null,null,null,null,null,null,null,null,null,null,null,null,null,null,null,null,null,null,null,null,null,null,null,null,null,null,null,null,null,null,null,null,null,null,null,null,"District 地區"]
[null,"Location Type 地點類別",null,null,null,null,null,null,null,null,null,null,null,null,"Roadside landscaped area 路旁綠化地區",null,null,null,null,null,null,null,null,null,null,null,null,null,null,null,null,null,null,null,null,null,null,null,null,null,null,"Tree pit/Tree ring 樹穴/樹圈",null,null,null,null,null,null,null,null,null,null,null,null,null,null,null,null,null,null,"Central divider 中央分隔帶"]
[null,null,null,null,null,null,null,null,null,null,null,null,null,null,"Public park or recreation venue 公園或康樂場地",null,null,null,null,null,null,null,null,null,null,null,null,null,null,null,null,null,null,null,null,null,null,null,null,null,null,"Housing estate 屋邨",null,null,null,null,null,null,null,null,null,null,null,null,null,null,null,null,null,null,"Government compound 政府建築物"]
[null,null,null,null,null,null,null,null,null,null,null,null,null,null,"Planter box 花盆",null,null,null,null,null,null,null,null,null,null,null,null,null,null,null,null,null,null,null,null,null,null,null,null,null,null,"SIMAR slopes 系統性鑑辨維修責任的斜坡     "]
{"$rows_left_out":183}
{"sheet":"Data","index":1,"n_rows":354,"n_cols":7,"rows_kept":354,"cut":false,"hidden":true,"merged":[]}
["Field Name","Field Value","Table","Table Field","Type","Remark","RADIO BTN VALUE"]
["Dept",{"$f":"IF(ISBLANK(Dept), \"\", Dept)","v":""}]
["InspOfficer",{"$f":"IF(ISBLANK(InspOfficer), \"\", InspOfficer)","v":""}]
["Post",{"$f":"IF(ISBLANK(Post), \"\", Post)","v":""}]
["ProjNo",{"$f":"IF(ISBLANK(ProjNo), \"\", ProjNo)","v":""}]
["FileRef",{"$f":"IF(ISBLANK(FileRef), \"\", FileRef)","v":""}]
["InspDate",{"$f":"IF(OR(ISBLANK(InspDate),ISBLANK(InspHr),ISBLANK(InspMin)), \"\", InspDate&\" \"&InspHr &\":\"&InspMin)","v":""}]
["LastInspDate",{"$f":"IF(ISBLANK(LastInspDate), \"\", LastInspDate)","v":""}]
["InspTimeSpent",{"$f":"IF(ISBLANK(InspTimeSpent), \"\", INDEX(List!H2:H10, MATCH(InspTimeSpent,List!G2:G10,0)))","v":""},null,null,null,{"$f":"IF(ISBLANK(InspTimeSpent), \"\", InspTimeSpent)","v":""}]
["IndpFreq",{"$f":"IF(ISBLANK(IndpFreq), \"\", INDEX(List!J2:J19, MATCH(IndpFreq,List!I2:I19,0)))","v":""},null,null,null,{"$f":"IF(ISBLANK(IndpFreq), \"\", IndpFreq)","v":""}]
["TreeID",{"$f":"IF(ISBLANK(TreeID), \"\", TreeID)","v":""}]
["TreeSpecies",{"$f":"IF(ISBLANK(TreeSpecies), \"\", INDEX(List!L2:L773, MATCH(TreeSpecies,TreeSpeciesNameList,0)))","v":""},null,null,null,{"$f":"IF(ISBLANK(TreeSpecies), \"\", TreeSpecies)","v":""}]
["TreeSpeciesOthers",{"$f":"IF(ISBLANK(TreeSpeciesOthers), \"\", TreeSpeciesOthers)","v":""}]
["Category",{"$f":"IF(ISBLANK(Category), \"\", INDEX(List!N2:N6, MATCH(Category,List!M2:M6,0)))","v":""},null,null,null,{"$f":"IF(ISBLANK(Category), \"\", Category)","v":""}]
["TreeHeight",{"$f":"IF(ISBLANK(TreeHeight), \"\", TreeHeight)","v":""}]
["CrownSpread",{"$f":"IF(ISBLANK(CrownSpread), \"\", CrownSpread)","v":""}]
["TrunkNum",{"$f":"IF(ISBLANK(TrunkNum), \"\", TrunkNum)","v":""}]
["TreeTrunkDBH1",{"$f":"IF(ISBLANK(TreeTrunkDBH1), \"\", TreeTrunkDBH1)","v":""}]
["TreeTrunkDBH2",{"$f":"IF(ISBLANK(TreeTrunkDBH2), \"\", TreeTrunkDBH2)","v":""}]
["TreeTrunkDBH3",{"$f":"IF(ISBLANK(TreeTrunkDBH3), \"\", TreeTrunkDBH3)","v":""}]
["TreeTrunkDBH4",{"$f":"IF(ISBLANK(TreeTrunkDBH4), \"\", TreeTrunkDBH4)","v":""}]
["TreeTrunkDBH5",{"$f":"IF(ISBLANK(TreeTrunkDBH5), \"\", TreeTrunkDBH5)","v":""}]
["TreeAggDBH",{"$f":"IF(ISBLANK(TreeAggDBH), \"\", TreeAggDBH)","v":0}]
["TreeRegOVT",false]
["TreeOVTNo",{"$f":"IF(ISBLANK(TreeOVTNo), \"\", TreeOVTNo)","v":""}]
["TreeRegWall",false]
["TreeWallRegNo",{"$f":"IF(ISBLANK(TreeWallRegNo), \"\", TreeWallRegNo)","v":""}]
["TreeRegMature",false]
["TreeRegOther",false]
["TreeRegRootInfect",false]
{"$rows_left_out":325}
{"sheet":"List","index":2,"n_rows":864,"n_cols":49,"rows_kept":864,"cut":false,"hidden":true,"merged":[[0,47,0,48],[0,27,0,28],[0,2,0,3],[0,6,0,7],[0,8,0,9],[0,10,0,11],[0,12,0,13],[0,14,0,15],[0,16,0,17],[0,18,0,19],[0,20,0,21],[0,22,0,23],[0,25,0,26],[0,29,0,30],[0,31,0,32],[0,35,0,36],[0,33,0,34],[0,45,0,46],[0,43,0,44],[0,41,0,42],[0,39,0,40],[0,37,0,38]]}
[null,null,"Department",null,"Full Dept Name","Dept Code","Inspection Time ",null,"Inspection Frequency",null,"Tree Species",null,"Triage Colour",null,"TRMZ Category",null,"Target Description",null,"Target zone",null,"Occupancy rate",null,"Tree Part",null,"Target Number","Failure",null,"Impact",null,"Failure and Impact",null,"Consequences of failure",null,"Risk rating MATRIX",null,"Risk rating ",null,"Residual risk",null,"Tree mitigation measures",null,"Advance assessment",null,"HK Districts",null,"Attachment Type",null,"PestDiseaseList"]
["Yes",1,"AFCD",1,"Agriculture, Fisheries and Conservation Department ","AFC","0.5 hr",1,"Less than 少於 3 months 個月",1,"Unidentified未能鑑別",-2,"Black 黑",3,"Category I 第一類",1,"People (residents, students, working staff, etc) 人(居民、學生、員工等）",1,"Within dripline 滴水線內",1,"Constant 恆常",1,"Whole Tree 整株",1,1,"Improbable 不太可能",1,"Very low 非常低",1,"Unlikely \n很低機會",1,"Negligible 微小",1,"Low\n低",1,"Extreme 極端",1,"Extreme 極端",1,"Crown cleaning 清理樹冠",1,"Risitographic test 微鑽探檢測",1,"Central and Western 中西區",1,"TREE 樹木",1,"Wood Decay Fungi 木腐真菌",2]
["No",0,"AMS",2,"Auxiliary Medical Service","AMS","1.0 hr",2,"3 months 個月",2,"Others其他",-1,"Red 紅",2,"Category II 第二類",2,"People (pedestrains, facility users, activity participants, etc.) 人（行人、設施使用者、活動參與者等）",2,"within 1.5 X Ht. 1.5倍樹高範圍內",2,"Frequent 經常",2,"Crown 樹冠",2,2,"Possible 有可能",2,"Low 低",2,"Somewhat likely \n有機會",2,"Minor 較小",2,"Moderate\n中",2,"High 高",2,"High 高",2,"Crown thinning 樹冠疏理",2,"Sonic Tomographic test  聲納探測",2,"Eastern 東區",2,"PHOTO 照片",2,"Emerald ash borer 白蠟樹蛀蟲",3]
[null,null,"ArchSD",3,"Architectural Services Department","ASD","1.5 hr",3,"6 months 個月",3,"Acacia auriculiformis耳果相思(耳葉相思)",1,"Orange 橙",4,"Category III 第三類",3,"People (vehicle drivers, bikers, etc.) 人（司機、單車駕駛者等）",3,null,null,"Occasional 偶爾",3,"Main trunk/codominant trunk 主幹/等勢幹",3,3,"Probable 相當可能",3,"Medium 中等",3,"Likely \n較大機會",3,"Significant 重大",3,"High\n高",3,"Moderate 中",3,"Moderate 中",3,"Crown reduction 縮減樹冠",3,"Aerial inspection 空中檢測",3,"Islands 離島區",3,"MAP 地圖",3,"Odontotermes formosanus Shiraki (termite) 白蟻",5]
[null,null,"BD",4,"Building Department","DLD","2.0 hr",4,"12 months 個月",4,"Acacia confusa台灣相思",2,"Yellow 黃",1,null,null,"Buildings (residential, commercial, school, utility, covered carparks, etc)建築物（民居、商業、學校、公用設施、有蓋停車場等）",4,null,null,"Rare 甚少",4,"Large branch (diamenter over 200 mm) 大型枝條（直徑>200毫米）",4,4,"Highly Probable 非常可能",4,"High 高",4,"Very likely\n很大機會",4,"Severe 嚴重",4,"Extreme\n極高",4,"Low 低",4,"Low 低",4,"Structural Pruning 結構修剪 ",4,"Root radar test 樹根雷達探測",4,"Kowloon City 九龍城區",4,"OTHER 其他",4,"Cerambycidae 天牛科幼蟲(蛀心蟲)",6]
[null,null,"C&SD ",5,"Census and Statistics Department","CNS","2.5 hr",5,"24 months 個月",5,"Acacia dealbata銀荊",3,"No 無",0,null,null,"Urban parks/seating out area/recreation site. 公園、休憩地點、康樂場地等",5,null,null,null,null,"Medium branch (diameter >100 mm but <200 mm) 中型枝條（直徑>100毫米 但<200毫米）",5,5,null,null,null,null,null,null,null,null,null,null,null,null,"None 沒有",5,"Crown raising 樹冠提升",5,"Soil/slope/wall stability test  土壤/斜坡/石牆穩定性檢測",5,"Kwai Tsing 葵青區",5,null,null,"Thrips palmi Karny/ Gynaikothrips uzeli 薊馬類/榕母管薊馬",7]
[null,null,"CAD",6,"Civil Aviation Department","CAD","3.0 hr",6,"36 months 個月",6,"Acacia holosericea絹毛相思",4,null,null,null,null,"Countryside/rural/country parks recreational site/parks/sitting out areas.  郊外、鄉村、郊野公園活動地點等",6,null,null,null,null,"Small branch (diameter 100mm or less)小型枝條（直徑<100毫米）",6,null,null,null,null,null,null,null,null,null,null,null,null,null,null,null,"Cabling, bracing or propping 纜索拉纜或支柱",6,"Others 其他",-1,"Kwun Tong 觀塘區",6,null,null,"Quadrastichus erythrinae 刺桐姬小蜂",8]
[null,null,"CAS",7,"Civil Aid Service","CAS","3.5 hr",7,"48 months 個月",7,"Acacia mangium大葉相思(馬占相思)",5,null,null,null,null,"Open carparks 露天停車場",7,null,null,null,null,"Fruit果實",7,null,null,null,null,null,null,null,null,null,null,null,null,null,null,null,"Pest/ disease control 病蟲害控制",7,null,null,"North 北區",7,null,null,"Phauda flammans 朱紅毛斑蛾",9]
[null,null,"CEDD",8,"Civil Engineering and Development Department","CED","4.0 hr",8,"60 months 個月",8,"Acer buergerianum三角槭",6,null,null,null,null,"Open space (square, promenade, plaza, etc.) 公共空間（廣場、散步地點、公眾地點等）",8,null,null,null,null,"Root樹根",8,null,null,null,null,null,null,null,null,null,null,null,null,null,null,null,"Removal 移除",8,null,null,"Sai Kung 西貢區",8,null,null,"Eriogyna pyretorum 樟天蠶蛾",10]
[null,null,"CPU",9,"Central Policy Unit","CPU","More than 4 hr.",9,"Over 超過 60 months 個月",9,"Acer palmatum雞爪槭",7,null,null,null,null,"Hiking trails/rural footpaths 遠足徑、鄉村小徑",9,null,null,null,null,null,null,null,null,null,null,null,null,null,null,null,null,null,null,null,null,null,"Others:",-1,null,null,"Sha Tin 沙田區",9,null,null,"Perina nuda 榕透翅毒蛾",11]
[null,null,"CSD",10,"Hong Kong Correctional Services","CSD",null,null,"Ad hoc",10,"Acer tutcheri嶺南槭",8,null,null,null,null,"Urban paths, pedestrian walkways, etc   市區行人徑、步行路徑",10,null,null,null,null,null,null,null,null,null,null,null,null,null,null,null,null,null,null,null,null,null,null,null,null,null,"Sham Shui Po 深水埗區",10,null,null,"Aphidoidea(Aphids) 芽蟲",12]
[null,null,"CSO",11,"Chief Secretary for Administration's Office","CSO",null,null,null,null,"Acmena acuminatissima肖蒲桃",9,null,null,null,null,"Bus stops, tram stops, taxi stops, minibus stops, etc. 巴士站站、電車站、的士站、小巴站等",11,null,null,null,null,null,null,null,null,null,null,null,null,null,null,null,null,null,null,null,null,null,null,null,null,null,"Southern 南區",11,null,null,"Pseudococcidae (mealy bugs) 粉介殼蟲",13]
[null,null,"CUSTOMS",12,"Customs and Excise Department","CUS",null,null,null,null,"Acmena 'Doubloon'紅車(千頭肖蒲桃)",10,null,null,null,null,"Expressways 幹線公路",12,null,null,null,null,null,null,null,null,null,null,null,null,null,null,null,null,null,null,null,null,null,null,null,null,null,"Tai Po 大埔區",12,null,null,"Collectotrichum spp. 炭疽病",14]
[null,null,"DEVB",13,"Development Bureau","DEV",null,null,null,null,"Acronychia pedunculata山油柑(降真香)",11,null,null,null,null,"Busy public road (4 lanes of above) 繁忙道路（4線行車道或以上）",13,null,null,null,null,null,null,null,null,null,null,null,null,null,null,null,null,null,null,null,null,null,null,null,null,null,"Tsuen Wan 荃灣區",13,null,null,"Phoma insidiosa 葉斑病",15]
[null,null,"DH",14,"Department of Health","DOH",null,null,null,null,"Adenanthera microsperma海紅豆",12,null,null,null,null,"Moderate public road (2 lanes) 中度繁忙道路（2線行車道）",14,null,null,null,null,null,null,null,null,null,null,null,null,null,null,null,null,null,null,null,null,null,null,null,null,null,"Tuen Mun 屯門區",14,null,null,"Phellinus noxius 有害木層孔菌(褐根病菌)",16]
[null,null,"DoJ",15,"Department of Justice","DOJ",null,null,null,null,"Adinandra millettii黃瑞木",13,null,null,null,null,"Minor public road/village road (1 lane) 疏落道路（1線行車道）",15,null,null,null,null,null,null,null,null,null,null,null,null,null,null,null,null,null,null,null,null,null,null,null,null,null,"Wan Chai 灣仔區",15,null,null,"Fuscoporia senex 老褐孔菌",17]
[null,null,"DSD",16,"Drainage Services Department","DSD",null,null,null,null,"Aegle marmelos木橘(肖木蘋果)",14,null,null,null,null,"Others 其他:",-1,null,null,null,null,null,null,null,null,null,null,null,null,null,null,null,null,null,null,null,null,null,null,null,null,null,"Wong Tai Sin 黃大仙區",16,null,null,"Ganoderma lucidum 赤靈芝",18]
[null,null,"EDB",17,"Education Bureau","EDB",null,null,null,null,"Agathis dammara貝殼杉",15,null,null,null,null,null,null,null,null,null,null,null,null,null,null,null,null,null,null,null,null,null,null,null,null,null,null,null,null,null,null,null,"Yau Tsim Mong 油尖旺區",17,null,null,"Ganoderma applanatum 樹舌靈芝",19]
[null,null,"EMSD",18,"Electrical and Mechanical Services Department","EMS",null,null,null,null,"Aglaia odorata米仔蘭",16,null,null,null,null,null,null,null,null,null,null,null,null,null,null,null,null,null,null,null,null,null,null,null,null,null,null,null,null,null,null,null,"Yuen Long 元朗區",18,null,null,"Inonotus rickii 瑞克纖孔菌",20]
[null,null,"EPD",19,"Environmental Protection Department","EPD",null,null,null,null,"Ailanthus fordii福氏臭椿(常綠臭椿)",17,null,null,null,null,null,null,null,null,null,null,null,null,null,null,null,null,null,null,null,null,null,null,null,null,null,null,null,null,null,null,null,null,null,null,null,"Kretzschmaria sandvicensis 炭墩屬",21]
[null,null,"FEHD",20,"Food and Environmental Hygiene Department","FEH",null,null,null,null,"Alangium chinense八角楓",18,null,null,null,null,null,null,null,null,null,null,null,null,null,null,null,null,null,null,null,null,null,null,null,null,null,null,null,null,null,null,null,null,null,null,null,"Rigidoporus ulmarius 榆硬孔菌",22]
[null,null,"FSD",21,"Fire Services Department","FSD",null,null,null,null,"Albizia chinensis楹樹",19]
[null,null,"GFS",22,"Government Flying Service","GFS",null,null,null,null,"Albizia julibrissin合歡",20]
[null,null,"GL",23,"Government Laboratory","GOL",null,null,null,null,"Albizia lebbeck大葉合歡",21]
[null,null,"GLD",24,"Government Logistics Department","GLD",null,null,null,null,"Albizia lucidior光葉合歡",22]
[null,null,"GPA",25,"Government Property Agency","GPA",null,null,null,null,"Albizia procera黃豆樹",23]
[null,null,"HAB",26,"Home Affairs Bureau","HAB",null,null,null,null,"Samanea saman (syn. Albizia saman)雨樹",24]
[null,null,"HAD",27,"Home Affairs Department","HAD",null,null,null,null,"Aleurites moluccana石栗",25]
[null,null,"HD",28,"Housing Department","HSD",null,null,null,null,"Alnus japonica赤楊",26]
[null,null,"HKO",29,"Hong Kong Observatory","HKO",null,null,null,null,"Alsophila spinulosa刺桫欏",27]
{"$rows_left_out":835}
{"sheet":"matrix","index":3,"n_rows":17,"n_cols":5,"rows_kept":17,"cut":false,"hidden":true,"merged":[]}
["Matrix 1: Likelihood matrix 可能性組合"]
["Likelihood of Failure\n倒塌的可能性","Likelihood of Impacting Target\n影響目標的可能性"]
[null,"Very Low          非常低","Low \n低","Medium\n中等","High\n高"]
["Highly Probable            非常可能","Unlikely \n很低機會","Somewhat likely \n有機會","Likely \n較大機會","Very likely\n很大機會"]
["Probable                          相當可能","Unlikely \n很低機會","Unlikely \n很低機會","Somewhat likely \n有機會","Likely \n較大機會"]
["Possible                           有可能","Unlikely \n很低機會","Unlikely \n很低機會","Unlikely \n很低機會","Somewhat likely \n有機會"]
["Improbable                    不太可能","Unlikely \n很低機會","Unlikely \n很低機會","Unlikely \n很低機會","Unlikely \n很低機會"]
[]
[]
[]
["Matrix 2: Risk rating matrix 風險評級組合"]
["Likelihood of Failure \nand Impact \n倒塌並影響的可能性","Consequences of Failure\n倒塌後果"]
[null,"Negligible        微小","Minor           較小","Significant        重大","Severe          嚴重"]
["Very likely\n很大機會","Low\n低","Moderate\n中","High\n高","Extreme\n極高"]
["Likely \n較大機會","Low\n低","Moderate\n中","High\n高","High\n高"]
["Somewhat likely \n有機會","Low\n低","Low\n低","Moderate\n中","Moderate\n中"]
["Unlikely \n很低機會","Low\n低","Low\n低","Low\n低","Low\n低"]